{"text_format":"1","workbook":"xlsx","n_sheets":3,"sheets":["Collateral Tables","Note Balances","Cumulative Defaults"],"not_rendered":{"charts":1,"images":0,"macros":1,"external_links":8,"defined_names":24,"comments":0,"pivot_tables":0},"unopened":[],"bounds":{"document_bytes":16777216,"sheet_cells":100000,"rows_first":2000,"rows_last":500,"rows_between":2000,"halvings":0,"cell_chars":16384,"cell_head_chars":4096},"cells_cut":0,"cells_raw":0,"read":"whole","date_system":"1900"}

{"sheet":"Collateral Tables","index":0,"n_rows":247,"n_cols":11,"rows_kept":247,"cut":false,"hidden":false,"merged":[]}
[null,"CNH CAPITAL AUSTRALIA RECEIVABLES TRUST SERIES 2013-1 (TERM DEAL)"]
[null,"COLLATERAL DATA TABLES"]
[]
[null,"OUTSTANDING RECEIVABLES",null,null,"2013-12-31",null,null,null,"2013-09-30"]
[]
[null,"Opening Balance",null,null,{"$f":"I13","v":367572501.20999992},null,null,null,399999996.31]
[null,"Principal Repayments - Scheduled",null,null,{"$f":"[3]Sheet1!$B$2+[4]Sheet1!$B$2+[5]Sheet1!$B$2","v":19784632.49000001},null,null,null,28316894.299999997]
[null,"Principal Repayments - Unscheduled",null,null,{"$f":"MAX('[2]16 Jan 14'!H23-'Collateral Tables'!E7,0)","v":4506158.3999999613},null,null,null,3783540.9800000787]
[{"$f":"SUM(I9)","v":327059.82},"Charge-Offs",null,null,{"$f":"'[2]16 Jan 14'!$H37","v":98493.91},null,null,null,327059.82]
[null,"Reinstatements"]
[null,"New Receivables Purchased"]
[null,"Non Cash Change in Receivables"]
[null,"Closing Balance",null,null,{"$f":"E6-E7-E8-E9+E10+E11-E12","v":343183216.40999991},null,null,null,367572501.20999992]
[]
[null,"PORTFOLIO STATISTICS"]
[]
[null,"Summary"]
[null,"Number of contracts",null,null,{"$f":"'[6]Servicer Recon'!$B$4","v":4387},null,null,null,4617]
[null,"Dollar value of contracts",null,null,{"$f":"'[6]Servicer Recon'!$B$5","v":343183216.41000015},null,null,null,367572501.21000028]
[null,"Number of contracts closed during the Quarter",null,null,{"$f":"'[6]Servicer Recon'!$B$19","v":228},null,null,null,183]
[null,"Dollar value of contracts closed during the Quarter",null,null,{"$f":"'[6]Servicer Recon'!$B$20","v":9069702.0300000031},null,null,null,8446613.110000005]
[]
[{"$f":"SUM(I23)","v":446.28363636364156},"Dollar Value of Recoveries from Collateral",null,null,{"$f":"MAX('[6]Servicer Recon'!$C$16,0)","v":94500},null,null,null,446.28363636364156]
[null,"Dollar Value of Recoveries from Other Sources",null,null,0,null,null,null,0]
[]
[null,"Average Term of Contracts (Months)",null,null,{"$f":"'[7]Revised Base Table'!$W$4390","v":51.719252312429639},null,null,null,51.33729628389451]
[null,"Average Term to Maturity (Months)",null,null,{"$f":"'[7]Revised Base Table'!$X$4390","v":31.625494308828717},null,null,null,33.937634820954983]
[null,"Average Residual / Balloon Payment *",null,null,{"$f":"'[7]Revised Base Table'!$AI$4390","v":2.8756254370488909E-2},null,null,null,3.0683073715412873E-2]
[null,"Average Seasoning (Months)",null,null,{"$f":"E26-E27","v":20.093758003600922},null,null,null,17.399661462939527]
[null,"Average Dollar Value of Individual Assets",null,null,{"$f":"E19/E18","v":78227.311695919794},null,null,null,79612.844100065035]
[null,"Weighted Average Interest Rate",null,null,{"$f":"'[7]Revised Base Table'!$AA$4390","v":5.6768052315365471},null,null,null,5.7023006689852697E-2]
[]
[null,"Payment in Arrears"]
["1. 0 - 30 Days","0 - 30 Days",null,null,{"$f":"IFERROR(VLOOKUP($A34,[8]Arrears!$A:$D,3,FALSE),0)","v":4375},{"$f":"IFERROR(VLOOKUP($A34,[8]Arrears!$A:$D,2,FALSE),0)","v":439735.71},{"$f":"F34/F$50","v":1.2813438681530656E-3},null,4592,151245.59999999998,4.1147147706131298E-4]
["2. 31 - 60 Days","31 - 60 Days",null,null,{"$f":"IFERROR(VLOOKUP($A35,[8]Arrears!$A:$D,3,FALSE),0)","v":7},{"$f":"IFERROR(VLOOKUP($A35,[8]Arrears!$A:$D,2,FALSE),0)","v":47270.050000000017},{"$f":"F35/F$50","v":1.3773998185134619E-4},null,12,113514.01999999996,3.0882076223419006E-4]
["3. 61 - 90 Days","61 - 90 Days",null,null,{"$f":"IFERROR(VLOOKUP($A36,[8]Arrears!$A:$D,3,FALSE),0)","v":5},{"$f":"IFERROR(VLOOKUP($A36,[8]Arrears!$A:$D,2,FALSE),0)","v":79546.5},2.3179018144338975E-4,null,6,75092.269999999975,2.0429240422721002E-4]
["4. 91 - 120 Days","91 - 120 Days",null,null,{"$f":"IFERROR(VLOOKUP($A37,[8]Arrears!$A:$D,3,FALSE),0)","v":0},{"$f":"IFERROR(VLOOKUP($A37,[8]Arrears!$A:$D,2,FALSE),0)","v":0},0,null,4,69228.5,1.8833971467427225E-4]
["5. 121 - 150 Days","121 - 150 Days",null,null,{"$f":"IFERROR(VLOOKUP($A38,[8]Arrears!$A:$D,3,FALSE),0)","v":0},{"$f":"IFERROR(VLOOKUP($A38,[8]Arrears!$A:$D,2,FALSE),0)","v":0},0,null,3,96751.01999999999,2.6321615376968745E-4]
["6. 151 - 180 Days","151 - 180 Days",null,null,{"$f":"IFERROR(VLOOKUP($A39,[8]Arrears!$A:$D,3,FALSE),0)","v":0},{"$f":"IFERROR(VLOOKUP($A39,[8]Arrears!$A:$D,2,FALSE),0)","v":0},0,null,0,0,0]
[null,"Total",null,null,{"$f":"SUM(E34:E39)","v":4387},{"$f":"SUM(F34:F39)","v":566552.26},{"$f":"SUM(G34:G39)","v":1.6508740314478015E-3},null,4617,505831.40999999992,1.3761405119666727E-3]
[null,"* Expressed as a % of Aggreg. Rec. closing bal.",null,null,null,"> 30 days",{"$f":"SUM(G35:G39)","v":3.6953016329473594E-4},null,null,"> 30 days",9.6466903490535977E-4]
[]
[" 0 - 30 Days","Account Balances in Arrears"]
["1. 0 - 30 Days","0 - 30 Days",null,null,{"$f":"IFERROR(VLOOKUP($A44,[8]Arrears!$A:$D,3,FALSE),0)","v":4375},{"$f":"IFERROR(VLOOKUP($A44,[8]Arrears!$A:$D,4,FALSE),0)","v":342575641.11000001},{"$f":"F44/F$50","v":0.99822958912048265},null,4592,366297114.92000002,0.99653024563643466]
["2. 31 - 60 Days","31 - 60 Days",null,null,{"$f":"IFERROR(VLOOKUP($A45,[8]Arrears!$A:$D,3,FALSE),0)","v":7},{"$f":"IFERROR(VLOOKUP($A45,[8]Arrears!$A:$D,4,FALSE),0)","v":207562.01},{"$f":"F45/F$50","v":6.0481398878209195E-4},null,12,447641.17,1.2178309545094492E-3]
["3. 61 - 90 Days","61 - 90 Days",null,null,{"$f":"IFERROR(VLOOKUP($A46,[8]Arrears!$A:$D,3,FALSE),0)","v":5},{"$f":"IFERROR(VLOOKUP($A46,[8]Arrears!$A:$D,4,FALSE),0)","v":400013.29000000004},1.1655968907351964E-3,null,6,318477.56,8.6643467330013539E-4]
["4. 91 - 120 Days","91 - 120 Days",null,null,{"$f":"IFERROR(VLOOKUP($A47,[8]Arrears!$A:$D,3,FALSE),0)","v":0},{"$f":"IFERROR(VLOOKUP($A47,[8]Arrears!$A:$D,2,FALSE),0)","v":0},0,null,4,167153.97,4.547510204102626E-4]
["5. 121 - 150 Days","121 - 150 Days",null,null,{"$f":"IFERROR(VLOOKUP($A48,[8]Arrears!$A:$D,3,FALSE),0)","v":0},{"$f":"IFERROR(VLOOKUP($A48,[8]Arrears!$A:$D,2,FALSE),0)","v":0},0,null,3,342113.59,9.3073771534542802E-4]
["6. 151 - 180 Days","151 - 180 Days",null,null,{"$f":"IFERROR(VLOOKUP($A49,[8]Arrears!$A:$D,3,FALSE),0)","v":0},{"$f":"IFERROR(VLOOKUP($A49,[8]Arrears!$A:$D,2,FALSE),0)","v":0},0,null,0,0,0]
[null,"Total",null,null,{"$f":"SUM(E44:E49)","v":4387},{"$f":"SUM(F44:F49)","v":343183216.41000003},{"$f":"SUM(G44:G49)","v":0.99999999999999989},null,4617,367572501.21000004,1]
["NSW",null,null,null,null,"> 30 days",{"$f":"SUM(G45:G49)","v":1.7704108795172885E-3},null,null,"> 30 days",3.4697543635652753E-3]
[null,null,null,null,null,">90 days",{"$f":"SUM(G47:G49)","v":0},null,null,">90 days",1.3854887357556906E-3]
[]
["VIC","Geographic Distribution"]
["NSW","New South Wales",null,null,{"$f":"F55/F$63","v":0.30462584249779701},{"$f":"IFERROR(VLOOKUP($A55,[8]Geographic!$A:$C,3,FALSE),0)","v":104542476.42999999},null,null,0.30594728550096595,112457808.97]
["VIC","Victoria",null,null,0.17346335124640827,{"$f":"IFERROR(VLOOKUP($A56,[8]Geographic!$A:$C,3,FALSE),0)","v":59529710.80999995},null,null,0.17560707835193193,64548333.020000048]
["QLD","Queensland",null,null,0.10914968331449117,{"$f":"IFERROR(VLOOKUP($A57,[8]Geographic!$A:$C,3,FALSE),0)","v":37458339.389999971},null,null,0.11503991220997688,42285508.270000011]
["SA","South Australia",null,null,0.20273041431863192,{"$f":"IFERROR(VLOOKUP($A58,[8]Geographic!$A:$C,3,FALSE),0)","v":69573675.649999991},null,null,0.19643661234807192,72204696.929999948]
["NT","Northern Territory",null,null,1.6685589872084282E-3,{"$f":"IFERROR(VLOOKUP($A59,[8]Geographic!$A:$C,3,FALSE),0)","v":572621.44000000018},null,null,1.6681469859185394E-3,613164.96000000008]
["ACT","Australian Capital Territory",null,null,7.7193157279436457E-4,{"$f":"IFERROR(VLOOKUP($A60,[8]Geographic!$A:$C,3,FALSE),0)","v":264913.95999999996},null,null,8.1428923277641842E-4,299310.32999999996]
["TAS","Tasmania",null,null,1.0762703807715622E-2,{"$f":"IFERROR(VLOOKUP($A61,[8]Geographic!$A:$C,3,FALSE),0)","v":3693579.3099999996},null,null,1.1006060019948898E-2,4045525.0099999984]
["WA","Western Australia",null,null,0.19682751425495335,{"$f":"IFERROR(VLOOKUP($A62,[8]Geographic!$A:$C,3,FALSE),0)","v":67547899.419999987},null,null,0.19348061535040967,71118153.719999984]
[null,"Total",null,null,{"$f":"SUM(E55:E62)","v":1},{"$f":"SUM(F55:F62)","v":343183216.40999985},null,null,1.0000000000000002,367572501.20999992]
["AG"]
["CE","Top Industry Distribution"]
["AGRICULTURAL MACHINERY","Agricultural",null,null,{"$f":"F66/F$69","v":0.97916386563188684},{"$f":"IFERROR(VLOOKUP($A66,'[8]Top Industry'!$A:$C,3,FALSE),)","v":336032604.80000001},null,null,0.97644352275674418,358913787.94999999]
["CONSTRUCTION EQUIPMENT","Construction",null,null,{"$f":"F67/F$69","v":2.0836134368113105E-2},{"$f":"IFERROR(VLOOKUP($A67,'[8]Top Industry'!$A:$C,3,FALSE),)","v":7150611.6099999985},null,null,2.3556477243255856E-2,8658713.2599999998]
["MOTOR VEHICLE - AG","Motor Vehicle AG",null,null,{"$f":"F68/F$69","v":0},{"$f":"IFERROR(VLOOKUP($A68,'[8]Top Industry'!$A:$C,3,FALSE),)","v":0},null,null,0,0]
[null,"Total",null,null,{"$f":"SUM(E66:E68)","v":1},{"$f":"SUM(F66:F68)","v":343183216.41000003},null,null,1,367572501.20999998]
["COMBINE"]
["40-100 HP TRACTOR","Collateral Types"]
["100<140 HP TRACTOR","100-140 HP TRACTOR",null,null,{"$f":"IFERROR(F72/F$107,0)","v":8.7623455547598025E-2},{"$f":"IFERROR(VLOOKUP($A72,[8]Collateral!$A:$C,3,FALSE),\"\")","v":30067418.989999987},null,null,8.9918451612853542E-2,33059288.450000003]
["4 EWD Tractors","4 EWD Tractors",null,null,0.1245816068646441,{"$f":"IFERROR(VLOOKUP($A73,[8]Collateral!$A:$C,3,FALSE),\"\")","v":42749368.290000014},null,null,0.1233070393158724,45334888.530000031]
["40<100 HP Tractor","40<100 HP Tractor",null,null,{"$f":"IFERROR(F74/F$107,0)","v":0},{"$f":"IFERROR(VLOOKUP($A74,[8]Collateral!$A:$C,3,FALSE),\"\")","v":""},null,null,0,""]
["40<60 HP TRACTOR","40-60 HP TRACTOR",null,null,{"$f":"IFERROR(F75/F$107,0)","v":9.5112862543643029E-3},{"$f":"IFERROR(VLOOKUP($A75,[8]Collateral!$A:$C,3,FALSE),\"\")","v":3263736.0300000003},null,null,1.0298926695894554E-2,3786488.56]
["4WD VEHICLE","4WD VEHICLE",null,null,1.3384916324903811E-4,{"$f":"IFERROR(VLOOKUP($A76,[8]Collateral!$A:$C,3,FALSE),\"\")","v":45929.47},null,null,1.2765896157056084E-4,46934.91]
["60<100 HP TRACTOR","60-100 HP TRACTOR",null,null,6.2184154973941315E-2,{"$f":"IFERROR(VLOOKUP($A77,[8]Collateral!$A:$C,3,FALSE),\"\")","v":21338088.419999991},null,null,6.6011998063524785E-2,24269876.16]
["Backhoes","Backhoes",null,null,8.2335594918440534E-4,{"$f":"IFERROR(VLOOKUP($A78,[8]Collateral!$A:$C,3,FALSE),\"\")","v":282529.24},null,null,8.6852040077186568E-4,319318.95999999996]
["BALERS, WINDROWERS, MOWERS, RAKES","BALERS, WINDROWERS, MOWERS, RAKES",null,null,3.6048004855360201E-2,{"$f":"IFERROR(VLOOKUP($A79,[8]Collateral!$A:$C,3,FALSE),\"\")","v":12369638.460000001},null,null,3.9300310659156019E-2,14449095.630000001]
["Cane Harvesters","Cane Harvesters",null,null,0,{"$f":"IFERROR(VLOOKUP($A80,[8]Collateral!$A:$C,3,FALSE),\"\")","v":""},null,null,0,""]
["Combines","Combines",null,null,0.38120910326133511,{"$f":"IFERROR(VLOOKUP($A81,[8]Collateral!$A:$C,3,FALSE),\"\")","v":130809424.9300002},null,null,0.37264571209175645,137006385.9500002]
["COMMERCIAL VEHICLE","COMMERCIAL VEHICLE",null,null,0,{"$f":"IFERROR(VLOOKUP($A82,[8]Collateral!$A:$C,3,FALSE),\"\")","v":""},null,null,0,""]
["Cotton Pickers","Cotton Pickers",null,null,7.2975341775279501E-4,{"$f":"IFERROR(VLOOKUP($A83,[8]Collateral!$A:$C,3,FALSE),\"\")","v":250410.13999999984},null,null,7.1059588521620812E-4,261256.65999999986]
["CRAWLERS / DOZERS","CRAWLERS / DOZERS",null,null,1.5865264944282321E-3,{"$f":"IFERROR(VLOOKUP($A84,[8]Collateral!$A:$C,3,FALSE),\"\")","v":544406.25},null,null,1.5803517257390951E-3,581029.84000000008]
["CULTIVATORS,SEEDERS, HARROWS","CULTIVATORS,SEEDERS, HARROWS",null,null,2.1698071788135178E-2,{"$f":"IFERROR(VLOOKUP($A85,[8]Collateral!$A:$C,3,FALSE),\"\")","v":7445552.2399999974},null,null,2.1460230402348207E-2,7890037.4099999974]
["Drill","Drill",null,null,5.0821682860507597E-4,{"$f":"IFERROR(VLOOKUP($A86,[8]Collateral!$A:$C,3,FALSE),\"\")","v":174391.3},null,null,5.2727424577352837E-4,193856.88999999998]
["DUMP TRUCKS","DUMP TRUCKS",null,null,6.8752475799320023E-4,{"$f":"IFERROR(VLOOKUP($A87,[8]Collateral!$A:$C,3,FALSE),\"\")","v":235919.65000000011},null,null,6.8179720854193756E-4,250668.58000000013]
["EXCAVATORS / GRADERS","EXCAVATORS / GRADERS",null,null,1.0644175447826629E-2,{"$f":"IFERROR(VLOOKUP($A88,[8]Collateral!$A:$C,3,FALSE),\"\")","v":3652479.5899999994},null,null,1.2932368141216314E-2,4754695.8499999996]
["FEEDERS, MIXERS, WAGONS, BINS, FEED STORAGE","FEEDERS, MIXERS, WAGONS, BINS, FEED STORAGE",null,null,1.9367128185578931E-3,{"$f":"IFERROR(VLOOKUP($A89,[8]Collateral!$A:$C,3,FALSE),\"\")","v":664570.41},null,null,2.2214069208371019E-3,816719.27]
["Front End Loader","Front End Loader",null,null,3.9864526368841067E-4,{"$f":"IFERROR(VLOOKUP($A90,[8]Collateral!$A:$C,3,FALSE),\"\")","v":136792.53000000003},null,null,3.8570743449030788E-4,141808.64000000001]
["Fronts","Fronts",null,null,6.8535309510094631E-3,{"$f":"IFERROR(VLOOKUP($A91,[8]Collateral!$A:$C,3,FALSE),\"\")","v":2351744.58},null,null,6.8944005520632581E-3,2534785.3799999994]
["GUIDANCE SYSTEMS","Guidance Systems",null,null,1.3862337873748745E-3,{"$f":"IFERROR(VLOOKUP($A92,[8]Collateral!$A:$C,3,FALSE),\"\")","v":475677.1100000001},null,null,1.4580108234005986E-3,536050.16]
["HARVESTERS - Other","HARVESTERS - Other",null,null,7.5045006231700328E-3,{"$f":"IFERROR(VLOOKUP($A93,[8]Collateral!$A:$C,3,FALSE),\"\")","v":2575120.59},null,null,7.3747272985226755E-3,2711381.6199999996]
["Irrigation Equipment","Irrigation Equipment",null,null,1.0168738812014238E-3,{"$f":"IFERROR(VLOOKUP($A94,[8]Collateral!$A:$C,3,FALSE),\"\")","v":348933.66},null,null,1.0129081990045133E-3,372404.37]
["Other AG","Other AG",null,null,6.5461804378795759E-3,{"$f":"IFERROR(VLOOKUP($A95,[8]Collateral!$A:$C,3,FALSE),\"\")","v":2246279.2499999995},null,null,6.5390135594409577E-3,2404124.3099999996]
["MATERIALS HANDLING EQUIPMENT","MATERIALS HANDLING EQUIPMENT",null,null,1.2226235181230223E-3,{"$f":"IFERROR(VLOOKUP($A96,[8]Collateral!$A:$C,3,FALSE),\"\")","v":419535.31},null,null,1.2439409266735096E-3,457345.52999999997]
["Other CE","Other CE",null,null,2.5686840832021161E-3,{"$f":"IFERROR(VLOOKUP($A97,[8]Collateral!$A:$C,3,FALSE),\"\")","v":881427.24},null,null,2.7089929841990915E-3,995984.46]
["Over 100 HP Tractor","Over 100 HP Tractor",null,null,0,{"$f":"IFERROR(VLOOKUP($A98,[8]Collateral!$A:$C,3,FALSE),\"\")","v":""},null,null,0,""]
["OVER 140 HP TRACTOR","OVER 140 HP TRACTOR",null,null,0.19241350059726964,{"$f":"IFERROR(VLOOKUP($A99,[8]Collateral!$A:$C,3,FALSE),\"\")","v":66025441.539999962},null,null,0.18879115664699647,69410684.819999933]
["Rollers","Rollers",null,null,3.6117630362419841E-5,{"$f":"IFERROR(VLOOKUP($A100,[8]Collateral!$A:$C,3,FALSE),\"\")","v":12393.529999999999},null,null,3.7566512784961905E-5,13811.65]
["SCRAPERS","SCRAPERS",null,null,1.0750429858233132E-3,{"$f":"IFERROR(VLOOKUP($A101,[8]Collateral!$A:$C,3,FALSE),\"\")","v":368894.00999999989},null,null,1.0764334437073871E-3,395759.9699999998]
["SKIDSTEER / UNILOADER","SKIDSTEER / UNILOADER",null,null,1.6916422266928743E-3,{"$f":"IFERROR(VLOOKUP($A102,[8]Collateral!$A:$C,3,FALSE),\"\")","v":580476.03000000014},null,null,1.8350795361410561E-3,674682.7]
["SPRAYING EQUIPMENT","SPRAYING EQUIPMENT",null,null,3.352257940917993E-2,{"$f":"IFERROR(VLOOKUP($A103,[8]Collateral!$A:$C,3,FALSE),\"\")","v":11503055.140000002},null,null,3.3795823318430528E-2,12425323.740000008]
["Trenchers","Trenchers",null,null,9.3951977074357128E-5,{"$f":"IFERROR(VLOOKUP($A104,[8]Collateral!$A:$C,3,FALSE),\"\")","v":32239.010000000009},null,null,1.0514432190910992E-4,38657.210000000021]
["Under 40 HP Tractors","Under 40 HP Tractors",null,null,3.3551931152915743E-3,{"$f":"IFERROR(VLOOKUP($A105,[8]Collateral!$A:$C,3,FALSE),\"\")","v":1151312.7000000004},null,null,3.6676840041111065E-3,1348455.4199999997]
["Wheel Loaders","Wheel Loaders",null,null,4.0890108968181474E-4,{"$f":"IFERROR(VLOOKUP($A106,[8]Collateral!$A:$C,3,FALSE),\"\")","v":140311.74999999997},null,null,4.807681070520768E-4,176758.50999999998]
[null,"Total",null,null,{"$f":"SUM(E72:E106)","v":1},{"$f":"SUM(F72:F106)","v":343143497.39000005},null,null,0.99999999999999989,367658560.1400001]
["$ 0 - $25,000"]
["$ 25,001 to $50,000","Contract Balance Distribution"]
["$0 - $25,000","$ 0 - $25,000",null,null,{"$f":"IFERROR(F110/F$121,0)","v":5.4787290493650498E-2},{"$f":"IFERROR(VLOOKUP($A110,'[8]Balance Distribution'!$A:$C,3,FALSE),\"\")","v":18802078.569999997},null,null,5.1203005197734706E-2,18820816.689999975]
["$25,001 - $50,000","$ 25,001 to $50,000",null,null,{"$f":"IFERROR(F111/F$121,0)","v":0.10649840100669625},{"$f":"IFERROR(VLOOKUP($A111,'[8]Balance Distribution'!$A:$C,3,FALSE),\"\")","v":36548463.800000004},null,null,0.10891893011095263,40035603.570000038]
["$50,001 - $75,000","$ 50,001 to $75,000",null,null,9.9457484946532004E-2,{"$f":"IFERROR(VLOOKUP($A112,'[8]Balance Distribution'!$A:$C,3,FALSE),\"\")","v":34132139.580000013},null,null,0.10035965214635163,36889448.360000014]
["$75,001 - $100,000","$ 75,001 to $100,000",null,null,9.1573594853353243E-2,{"$f":"IFERROR(VLOOKUP($A113,'[8]Balance Distribution'!$A:$C,3,FALSE),\"\")","v":31426520.819999993},null,null,8.6953044895324877E-2,31961548.199999984]
["$100,001 - $125,000","$100,001 to $125,000",null,null,9.0804248313735347E-2,{"$f":"IFERROR(VLOOKUP($A114,'[8]Balance Distribution'!$A:$C,3,FALSE),\"\")","v":31162494.000000019},null,null,9.1619316676684562E-2,33676741.390000008]
["$125,001 - $150,000","$125,001 to $150,000",null,null,8.9654056488711956E-2,{"$f":"IFERROR(VLOOKUP($A115,'[8]Balance Distribution'!$A:$C,3,FALSE),\"\")","v":30767767.470000003},null,null,9.1784657173593145E-2,33737516.009999998]
["$150,001 - $200,000","$150,000 to $200,000",null,null,0.1672794451329328,{"$f":"IFERROR(VLOOKUP($A116,'[8]Balance Distribution'!$A:$C,3,FALSE),\"\")","v":57407498.020000003},null,null,0.16863151189481226,61984306.610000007]
["$200,001 - $300,000","$200,001 to $300,000",null,null,0.23213452068945239,{"$f":"IFERROR(VLOOKUP($A117,'[8]Balance Distribution'!$A:$C,3,FALSE),\"\")","v":79664671.449999973},null,null,0.2317617934409352,85189262.09999992]
["$300,001 - $400,000","$300,001 to $400,000",null,null,2.9833169224011229E-2,{"$f":"IFERROR(VLOOKUP($A118,'[8]Balance Distribution'!$A:$C,3,FALSE),\"\")","v":10238242.969999999},null,null,2.8671342946786482E-2,10538797.239999998]
["$400,001 - $500,000","$400,001 to $500,000",null,null,6.3606991997887012E-3,{"$f":"IFERROR(VLOOKUP($A119,'[8]Balance Distribution'!$A:$C,3,FALSE),\"\")","v":2182885.21},null,null,4.6820749493900913E-3,1721002]
["$500,001+","$500,000+",null,null,3.161708965113548E-2,{"$f":"IFERROR(VLOOKUP($A120,'[8]Balance Distribution'!$A:$C,3,FALSE),\"\")","v":10850454.52},null,null,3.5414670567434317E-2,13017459.040000001]
{"$rows_left_out":128}
{"sheet":"Note Balances","index":1,"n_rows":20,"n_cols":9,"rows_kept":20,"cut":false,"hidden":false,"merged":[]}
[null,null,"TOTAL NOTE BALANCES"]
[null,null,null,"Total Notes","Class A1 Notes","Class A2 Notes","Class B Notes","Class C Notes","Seller Notes"]
[null,null,"Initial Invested Amount",400000000,100000000,244800000,13600000,12000000,29600000]
["(a)",null,"Invested Amount as at Previous Payment Date:  16 October 2013",367899561.02999997,67899561.030000001,244800000,13600000,12000000,29600000]
["(b)",null,"Stated Amount as at Previous Payment Date:  16 October 2013",367572501.20999998,67899561.030000001,244800000,13600000,12000000,29272940.18]
["(d)",null,"Principal Payments to Noteholders on Payment Date",24290790.890000001,24290790.890000001,0,0,0,0]
[null,null,"Gross Aggregate Charge-Offs",0,0,0,0,0,0]
[null,null,"Gross Aggregate Reinstatements of charge-offs",0,0,0,0,0,0]
["(e)",null,"Aggregate Charge-Offs for this Collection Period",98493.91,0,0,0,0,98493.91]
["(f)",null,"Reinstatements relating to Charge-offs that have occurred this Collection Period",0,0,0,0,0,0]
[null,null,"Aggregate Carry Over Charge-offs not previously reinstated",0,0,0,0,0,0]
[null,null,"Reinstatements of Carry Over Charge-offs not previously reinstated",0,0,0,0,0,0]
[null,null,"Aggregate Charge-Offs not reinstated and to be carried over to next period",98493.91,0,0,0,0,98493.91]
[null,null,"Invested Amount as at Payment Date:  16 January 2014",343608770.13999999,43608770.140000001,244800000,13600000,12000000,29600000]
[null,null,"Stated Amount as at Payment Date:  16 January 2014",343183216.40999997,43608770.140000001,244800000,13600000,12000000,29174446.27]
[null,null,"Bond Factor at Payment Date:  16 January 2014",null,0.43608770140000003,1,1,1,0.98562318479729727]
[null,null,"Coupon Margin",null,4.4999999999999997E-3,1.0999999999999999E-2,1.7500000000000002E-2,2.5000000000000001E-2,0.01]
[null,null,"Coupon Rate (3 month BBSW + margin)",null,3.0450000000000001E-2,3.6949999999999997E-2,4.3450000000000003E-2,5.0950000000000002E-2,3.5950000000000003E-2]
[null,null,"Days in Coupon Period",null,92,92,92,92,92]
[null,null,"Coupon Entitlement to be paid out on the current Payment Date: 16 January 2014",null,521133.78,2279926.36,148944.22,154106.29999999999,265252.94]

{"sheet":"Cumulative Defaults","index":2,"n_rows":5,"n_cols":4,"rows_kept":5,"cut":false,"hidden":false,"merged":[]}
["Cumulative Defaults & Losses"]
[]
["Month","Gross Losses","Recoveries","Net Losses"]
["2013-09-01",{"$f":"'Collateral Tables'!I9/400000000","v":8.1764955000000002E-4},{"$f":"'Collateral Tables'!I23/400000000","v":1.1157090909091038E-6},{"$f":"B4-C4","v":8.1653384090909088E-4}]
["2013-12-01",{"$f":"'Collateral Tables'!E9/400000000","v":2.4623477500000001E-4},{"$f":"'Collateral Tables'!E23/400000000","v":2.3625E-4},{"$f":"B5-C5","v":9.9847750000000115E-6}]